{"text_format":"1","workbook":"xlsx","n_sheets":5,"sheets":["Dashboard","PurchaseInfo","SaleInfo","Instructions","JSESiteQuery"],"not_rendered":{"charts":2,"images":3,"macros":1,"external_links":0,"defined_names":3,"comments":0,"pivot_tables":0},"unopened":[],"bounds":{"document_bytes":16777216,"sheet_cells":100000,"rows_first":2000,"rows_last":500,"rows_between":2000,"halvings":0,"cell_chars":16384,"cell_head_chars":4096},"cells_cut":0,"cells_raw":0,"read":"row_number_cap","date_system":"1900"}

{"sheet":"Dashboard","index":0,"n_rows":100,"n_cols":8,"rows_kept":100,"cut":false,"hidden":false,"merged":[],"read":"row_number_cap"}
[]
[]
[]
[null,null,{"$f":"CONCATENATE(COUNTIF(Table1[Gain/Loss (%)],\">1%\"),\" SHARE(S)\")","v":"4 SHARE(S)"}]
[null,null,null,{"$f":"CONCATENATE(COUNTIF(Table1[Gain/Loss (%)],\"<1%\"),\" SHARE(S)\")","v":"0 SHARE(S)"}]
[]
[]
[]
[]
[null,null,"Initial Portfolio Value",{"$f":"SUM(E:E)","v":1344824.7}]
[null,null,"Current Portfolio Value",{"$f":"SUM(F:F)","v":2148057.62}]
[null,null,"Total Gain/Loss (%)",{"$f":"(SUM(F:F)/SUM(E:E))-1","v":0.59727704287406391}]
[null,null,"Total Gain/Loss ($)",{"$f":"SUM(G:G)","v":803232.92000000016}]
[]
[null,null,null,null,null,null,null,{"$f":"CONCATENATE(\"Closing Prices as of \",SUBSTITUTE(JSESiteQuery!A15,\"Combined Market for \",\"\"))","v":"Closing Prices as of May 15, 2020"}]
["Stock","Avg. Purchase Price","Volume","Current Price","Total Spend","Current Value","Gain/Loss ($)","Gain/Loss (%)"]
["NCBFG (JMD)",{"$f":"_xlfn.IFNA(VLOOKUP(A17,PurchaseInfo!B:H,7,),\"\")","v":61.3},{"$f":"IF(ISBLANK(A17),\"\",SUMIF(PurchaseInfo!B:B,Dashboard!A17,PurchaseInfo!C:C)-SUMIF(SaleInfo!B:B,Dashboard!A17,SaleInfo!C:C))","v":3472},{"$f":"_xlfn.IFNA(VLOOKUP(A17,JSESiteQuery!A:M,3,),\"\")","v":148.22999999999999},{"$f":"IF(ISBLANK(A17),\"\",(B17*C17))","v":212833.59999999998},{"$f":"IFERROR(D17*C17,\"\")","v":514654.55999999994},{"$f":"IFERROR(F17-E17,\"\")","v":301820.95999999996},{"$f":"IFERROR((F17/E17)-1,\"\")","v":1.4181076672104402}]
["LAB (JMD)",{"$f":"_xlfn.IFNA(VLOOKUP(A18,PurchaseInfo!B:H,7,),\"\")","v":1.7236251868487114},{"$f":"IF(ISBLANK(A18),\"\",SUMIF(PurchaseInfo!B:B,Dashboard!A18,PurchaseInfo!C:C)-SUMIF(SaleInfo!B:B,Dashboard!A18,SaleInfo!C:C))","v":279638},{"$f":"_xlfn.IFNA(VLOOKUP(A18,JSESiteQuery!A:M,3,),\"\")","v":1.87},{"$f":"IF(ISBLANK(A18),\"\",(B18*C18))","v":481991.09999999992},{"$f":"IFERROR(D18*C18,\"\")","v":522923.06000000006},{"$f":"IFERROR(F18-E18,\"\")","v":40931.960000000137},{"$f":"IFERROR((F18/E18)-1,\"\")","v":8.4922646911945288E-2}]
["SCIJMD (JMD)",{"$f":"_xlfn.IFNA(VLOOKUP(A19,PurchaseInfo!B:H,7,),\"\")","v":10.384615384615385},{"$f":"IF(ISBLANK(A19),\"\",SUMIF(PurchaseInfo!B:B,Dashboard!A19,PurchaseInfo!C:C)-SUMIF(SaleInfo!B:B,Dashboard!A19,SaleInfo!C:C))","v":52000},{"$f":"_xlfn.IFNA(VLOOKUP(A19,JSESiteQuery!A:M,3,),\"\")","v":18.690000000000001},540000,971880.00000000012,431880.00000000012,0.79977777777777792]
["WIG (JMD)",{"$f":"_xlfn.IFNA(VLOOKUP(A20,PurchaseInfo!B:H,7,),\"\")","v":0.55555555555555558},{"$f":"IF(ISBLANK(A20),\"\",SUMIF(PurchaseInfo!B:B,Dashboard!A20,PurchaseInfo!C:C)-SUMIF(SaleInfo!B:B,Dashboard!A20,SaleInfo!C:C))","v":198000},{"$f":"_xlfn.IFNA(VLOOKUP(A20,JSESiteQuery!A:M,3,),\"\")","v":0.7},{"$f":"IF(ISBLANK(A20),\"\",(B20*C20))","v":110000},{"$f":"IFERROR(D20*C20,\"\")","v":138600},{"$f":"IFERROR(F20-E20,\"\")","v":28600},{"$f":"IFERROR((F20/E20)-1,\"\")","v":0.26}]
[null,{"$f":"_xlfn.IFNA(VLOOKUP(A21,PurchaseInfo!B:H,7,),\"\")","v":""},{"$f":"IF(ISBLANK(A21),\"\",SUMIF(PurchaseInfo!B:B,Dashboard!A21,PurchaseInfo!C:C)-SUMIF(SaleInfo!B:B,Dashboard!A21,SaleInfo!C:C))","v":""},{"$f":"_xlfn.IFNA(VLOOKUP(A21,JSESiteQuery!A:M,3,),\"\")","v":""},{"$f":"IF(ISBLANK(A21),\"\",(B21*C21))","v":""},{"$f":"IFERROR(D21*C21,\"\")","v":""},{"$f":"IFERROR(F21-E21,\"\")","v":""},{"$f":"IFERROR((F21/E21)-1,\"\")","v":""}]
[null,{"$f":"_xlfn.IFNA(VLOOKUP(A22,PurchaseInfo!B:H,7,),\"\")","v":""},{"$f":"IF(ISBLANK(A22),\"\",SUMIF(PurchaseInfo!B:B,Dashboard!A22,PurchaseInfo!C:C)-SUMIF(SaleInfo!B:B,Dashboard!A22,SaleInfo!C:C))","v":""},{"$f":"_xlfn.IFNA(VLOOKUP(A22,JSESiteQuery!A:M,3,),\"\")","v":""},"","","",""]
[null,{"$f":"_xlfn.IFNA(VLOOKUP(A23,PurchaseInfo!B:H,7,),\"\")","v":""},{"$f":"IF(ISBLANK(A23),\"\",SUMIF(PurchaseInfo!B:B,Dashboard!A23,PurchaseInfo!C:C)-SUMIF(SaleInfo!B:B,Dashboard!A23,SaleInfo!C:C))","v":""},{"$f":"_xlfn.IFNA(VLOOKUP(A23,JSESiteQuery!A:M,3,),\"\")","v":""},"","","",""]
[null,{"$f":"_xlfn.IFNA(VLOOKUP(A24,PurchaseInfo!B:H,7,),\"\")","v":""},{"$f":"IF(ISBLANK(A24),\"\",SUMIF(PurchaseInfo!B:B,Dashboard!A24,PurchaseInfo!C:C)-SUMIF(SaleInfo!B:B,Dashboard!A24,SaleInfo!C:C))","v":""},{"$f":"_xlfn.IFNA(VLOOKUP(A24,JSESiteQuery!A:M,3,),\"\")","v":""},"","","",""]
[null,{"$f":"_xlfn.IFNA(VLOOKUP(A25,PurchaseInfo!B:H,7,),\"\")","v":""},{"$f":"IF(ISBLANK(A25),\"\",SUMIF(PurchaseInfo!B:B,Dashboard!A25,PurchaseInfo!C:C)-SUMIF(SaleInfo!B:B,Dashboard!A25,SaleInfo!C:C))","v":""},{"$f":"_xlfn.IFNA(VLOOKUP(A25,JSESiteQuery!A:M,3,),\"\")","v":""},"","","",""]
[null,{"$f":"_xlfn.IFNA(VLOOKUP(A26,PurchaseInfo!B:H,7,),\"\")","v":""},{"$f":"IF(ISBLANK(A26),\"\",SUMIF(PurchaseInfo!B:B,Dashboard!A26,PurchaseInfo!C:C)-SUMIF(SaleInfo!B:B,Dashboard!A26,SaleInfo!C:C))","v":""},{"$f":"_xlfn.IFNA(VLOOKUP(A26,JSESiteQuery!A:M,3,),\"\")","v":""},"","","",""]
[null,{"$f":"_xlfn.IFNA(VLOOKUP(A27,PurchaseInfo!B:H,7,),\"\")","v":""},{"$f":"IF(ISBLANK(A27),\"\",SUMIF(PurchaseInfo!B:B,Dashboard!A27,PurchaseInfo!C:C)-SUMIF(SaleInfo!B:B,Dashboard!A27,SaleInfo!C:C))","v":""},{"$f":"_xlfn.IFNA(VLOOKUP(A27,JSESiteQuery!A:M,3,),\"\")","v":""},"","","",""]
[null,{"$f":"_xlfn.IFNA(VLOOKUP(A28,PurchaseInfo!B:H,7,),\"\")","v":""},{"$f":"IF(ISBLANK(A28),\"\",SUMIF(PurchaseInfo!B:B,Dashboard!A28,PurchaseInfo!C:C)-SUMIF(SaleInfo!B:B,Dashboard!A28,SaleInfo!C:C))","v":""},{"$f":"_xlfn.IFNA(VLOOKUP(A28,JSESiteQuery!A:M,3,),\"\")","v":""},"","","",""]
[null,{"$f":"_xlfn.IFNA(VLOOKUP(A29,PurchaseInfo!B:H,7,),\"\")","v":""},{"$f":"IF(ISBLANK(A29),\"\",SUMIF(PurchaseInfo!B:B,Dashboard!A29,PurchaseInfo!C:C)-SUMIF(SaleInfo!B:B,Dashboard!A29,SaleInfo!C:C))","v":""},{"$f":"_xlfn.IFNA(VLOOKUP(A29,JSESiteQuery!A:M,3,),\"\")","v":""},"","","",""]
[null,{"$f":"_xlfn.IFNA(VLOOKUP(A30,PurchaseInfo!B:H,7,),\"\")","v":""},{"$f":"IF(ISBLANK(A30),\"\",SUMIF(PurchaseInfo!B:B,Dashboard!A30,PurchaseInfo!C:C)-SUMIF(SaleInfo!B:B,Dashboard!A30,SaleInfo!C:C))","v":""},{"$f":"_xlfn.IFNA(VLOOKUP(A30,JSESiteQuery!A:M,3,),\"\")","v":""},"","","",""]
[null,{"$f":"_xlfn.IFNA(VLOOKUP(A31,PurchaseInfo!B:H,7,),\"\")","v":""},{"$f":"IF(ISBLANK(A31),\"\",SUMIF(PurchaseInfo!B:B,Dashboard!A31,PurchaseInfo!C:C)-SUMIF(SaleInfo!B:B,Dashboard!A31,SaleInfo!C:C))","v":""},{"$f":"_xlfn.IFNA(VLOOKUP(A31,JSESiteQuery!A:M,3,),\"\")","v":""},"","","",""]
[null,{"$f":"_xlfn.IFNA(VLOOKUP(A32,PurchaseInfo!B:H,7,),\"\")","v":""},{"$f":"IF(ISBLANK(A32),\"\",SUMIF(PurchaseInfo!B:B,Dashboard!A32,PurchaseInfo!C:C)-SUMIF(SaleInfo!B:B,Dashboard!A32,SaleInfo!C:C))","v":""},{"$f":"_xlfn.IFNA(VLOOKUP(A32,JSESiteQuery!A:M,3,),\"\")","v":""},"","","",""]
[null,{"$f":"_xlfn.IFNA(VLOOKUP(A33,PurchaseInfo!B:H,7,),\"\")","v":""},{"$f":"IF(ISBLANK(A33),\"\",SUMIF(PurchaseInfo!B:B,Dashboard!A33,PurchaseInfo!C:C)-SUMIF(SaleInfo!B:B,Dashboard!A33,SaleInfo!C:C))","v":""},{"$f":"_xlfn.IFNA(VLOOKUP(A33,JSESiteQuery!A:M,3,),\"\")","v":""},"","","",""]
[null,{"$f":"_xlfn.IFNA(VLOOKUP(A34,PurchaseInfo!B:H,7,),\"\")","v":""},{"$f":"IF(ISBLANK(A34),\"\",SUMIF(PurchaseInfo!B:B,Dashboard!A34,PurchaseInfo!C:C)-SUMIF(SaleInfo!B:B,Dashboard!A34,SaleInfo!C:C))","v":""},{"$f":"_xlfn.IFNA(VLOOKUP(A34,JSESiteQuery!A:M,3,),\"\")","v":""},"","","",""]
[null,{"$f":"_xlfn.IFNA(VLOOKUP(A35,PurchaseInfo!B:H,7,),\"\")","v":""},{"$f":"IF(ISBLANK(A35),\"\",SUMIF(PurchaseInfo!B:B,Dashboard!A35,PurchaseInfo!C:C)-SUMIF(SaleInfo!B:B,Dashboard!A35,SaleInfo!C:C))","v":""},{"$f":"_xlfn.IFNA(VLOOKUP(A35,JSESiteQuery!A:M,3,),\"\")","v":""},"","","",""]
[null,{"$f":"_xlfn.IFNA(VLOOKUP(A36,PurchaseInfo!B:H,7,),\"\")","v":""},{"$f":"IF(ISBLANK(A36),\"\",SUMIF(PurchaseInfo!B:B,Dashboard!A36,PurchaseInfo!C:C)-SUMIF(SaleInfo!B:B,Dashboard!A36,SaleInfo!C:C))","v":""},{"$f":"_xlfn.IFNA(VLOOKUP(A36,JSESiteQuery!A:M,3,),\"\")","v":""},"","","",""]
[null,{"$f":"_xlfn.IFNA(VLOOKUP(A37,PurchaseInfo!B:H,7,),\"\")","v":""},{"$f":"IF(ISBLANK(A37),\"\",SUMIF(PurchaseInfo!B:B,Dashboard!A37,PurchaseInfo!C:C)-SUMIF(SaleInfo!B:B,Dashboard!A37,SaleInfo!C:C))","v":""},{"$f":"_xlfn.IFNA(VLOOKUP(A37,JSESiteQuery!A:M,3,),\"\")","v":""},"","","",""]
[null,{"$f":"_xlfn.IFNA(VLOOKUP(A38,PurchaseInfo!B:H,7,),\"\")","v":""},{"$f":"IF(ISBLANK(A38),\"\",SUMIF(PurchaseInfo!B:B,Dashboard!A38,PurchaseInfo!C:C)-SUMIF(SaleInfo!B:B,Dashboard!A38,SaleInfo!C:C))","v":""},{"$f":"_xlfn.IFNA(VLOOKUP(A38,JSESiteQuery!A:M,3,),\"\")","v":""},"","","",""]
[null,{"$f":"_xlfn.IFNA(VLOOKUP(A39,PurchaseInfo!B:H,7,),\"\")","v":""},{"$f":"IF(ISBLANK(A39),\"\",SUMIF(PurchaseInfo!B:B,Dashboard!A39,PurchaseInfo!C:C)-SUMIF(SaleInfo!B:B,Dashboard!A39,SaleInfo!C:C))","v":""},{"$f":"_xlfn.IFNA(VLOOKUP(A39,JSESiteQuery!A:M,3,),\"\")","v":""},"","","",""]
[null,{"$f":"_xlfn.IFNA(VLOOKUP(A40,PurchaseInfo!B:H,7,),\"\")","v":""},{"$f":"IF(ISBLANK(A40),\"\",SUMIF(PurchaseInfo!B:B,Dashboard!A40,PurchaseInfo!C:C)-SUMIF(SaleInfo!B:B,Dashboard!A40,SaleInfo!C:C))","v":""},{"$f":"_xlfn.IFNA(VLOOKUP(A40,JSESiteQuery!A:M,3,),\"\")","v":""},"","","",""]
{"$rows_left_out":61}
{"sheet":"PurchaseInfo","index":1,"n_rows":1002,"n_cols":8,"rows_kept":1002,"cut":false,"hidden":false,"merged":[[0,3,0,4]]}
["Purchase Info",null,null,"Only enter shares bought, not sold.\n(Enter Volume Bought and Amount Spent)"]
["Date","Stock","Volume Bought","Amount Spent","Purchase Cost","Notes",null,"Avg. Cost"]
["2019-05-01","WIG (JMD)",198000,110000,{"$f":"IFERROR(D3/C3,\"\")","v":0.55555555555555558},null,null,{"$f":"IFERROR(SUMIF(B:B,B3,D:D)/SUMIF(B:B,B3,C:C),\"\")","v":0.55555555555555558}]
["2019-07-17","LAB (JMD)",22638,22801.1,1.0072047000618429,null,null,{"$f":"IFERROR(SUMIF(B:B,B4,D:D)/SUMIF(B:B,B4,C:C),\"\")","v":1.7236251868487114}]
["2019-07-30","LAB (JMD)",257000,459190,1.7867315175097276,null,null,{"$f":"IFERROR(SUMIF(B:B,B5,D:D)/SUMIF(B:B,B5,C:C),\"\")","v":1.7236251868487114}]
["2017-11-02","NCBFG (JMD)",15472,948433.6,61.3,null,null,{"$f":"IFERROR(SUMIF(B:B,B6,D:D)/SUMIF(B:B,B6,C:C),\"\")","v":61.3}]
["2018-12-11","SCIJMD (JMD)",52000,540000,10.384615384615385,null,null,{"$f":"IFERROR(SUMIF(B:B,B7,D:D)/SUMIF(B:B,B7,C:C),\"\")","v":10.384615384615385}]
[null,null,null,null,"",null,null,{"$f":"IFERROR(SUMIF(B:B,B8,D:D)/SUMIF(B:B,B8,C:C),\"\")","v":""}]
[null,null,null,null,"",null,null,{"$f":"IFERROR(SUMIF(B:B,B9,D:D)/SUMIF(B:B,B9,C:C),\"\")","v":""}]
[null,null,null,null,"",null,null,{"$f":"IFERROR(SUMIF(B:B,B10,D:D)/SUMIF(B:B,B10,C:C),\"\")","v":""}]
[null,null,null,null,"",null,null,{"$f":"IFERROR(SUMIF(B:B,B11,D:D)/SUMIF(B:B,B11,C:C),\"\")","v":""}]
[null,null,null,null,"",null,null,{"$f":"IFERROR(SUMIF(B:B,B12,D:D)/SUMIF(B:B,B12,C:C),\"\")","v":""}]
[null,null,null,null,"",null,null,{"$f":"IFERROR(SUMIF(B:B,B13,D:D)/SUMIF(B:B,B13,C:C),\"\")","v":""}]
[null,null,null,null,"",null,null,{"$f":"IFERROR(SUMIF(B:B,B14,D:D)/SUMIF(B:B,B14,C:C),\"\")","v":""}]
[null,null,null,null,"",null,null,{"$f":"IFERROR(SUMIF(B:B,B15,D:D)/SUMIF(B:B,B15,C:C),\"\")","v":""}]
[null,null,null,null,"",null,null,{"$f":"IFERROR(SUMIF(B:B,B16,D:D)/SUMIF(B:B,B16,C:C),\"\")","v":""}]
[null,null,null,null,"",null,null,{"$f":"IFERROR(SUMIF(B:B,B17,D:D)/SUMIF(B:B,B17,C:C),\"\")","v":""}]
[null,null,null,null,"",null,null,{"$f":"IFERROR(SUMIF(B:B,B18,D:D)/SUMIF(B:B,B18,C:C),\"\")","v":""}]
[null,null,null,null,"",null,null,{"$f":"IFERROR(SUMIF(B:B,B19,D:D)/SUMIF(B:B,B19,C:C),\"\")","v":""}]
[null,null,null,null,"",null,null,{"$f":"IFERROR(SUMIF(B:B,B20,D:D)/SUMIF(B:B,B20,C:C),\"\")","v":""}]
[null,null,null,null,"",null,null,{"$f":"IFERROR(SUMIF(B:B,B21,D:D)/SUMIF(B:B,B21,C:C),\"\")","v":""}]
[null,null,null,null,"",null,null,{"$f":"IFERROR(SUMIF(B:B,B22,D:D)/SUMIF(B:B,B22,C:C),\"\")","v":""}]
[null,null,null,null,"",null,null,{"$f":"IFERROR(SUMIF(B:B,B23,D:D)/SUMIF(B:B,B23,C:C),\"\")","v":""}]
[null,null,null,null,"",null,null,{"$f":"IFERROR(SUMIF(B:B,B24,D:D)/SUMIF(B:B,B24,C:C),\"\")","v":""}]
[null,null,null,null,"",null,null,{"$f":"IFERROR(SUMIF(B:B,B25,D:D)/SUMIF(B:B,B25,C:C),\"\")","v":""}]
[null,null,null,null,"",null,null,{"$f":"IFERROR(SUMIF(B:B,B26,D:D)/SUMIF(B:B,B26,C:C),\"\")","v":""}]
[null,null,null,null,"",null,null,{"$f":"IFERROR(SUMIF(B:B,B27,D:D)/SUMIF(B:B,B27,C:C),\"\")","v":""}]
[null,null,null,null,"",null,null,{"$f":"IFERROR(SUMIF(B:B,B28,D:D)/SUMIF(B:B,B28,C:C),\"\")","v":""}]
[null,null,null,null,"",null,null,{"$f":"IFERROR(SUMIF(B:B,B29,D:D)/SUMIF(B:B,B29,C:C),\"\")","v":""}]
[null,null,null,null,"",null,null,{"$f":"IFERROR(SUMIF(B:B,B30,D:D)/SUMIF(B:B,B30,C:C),\"\")","v":""}]
[null,null,null,null,"",null,null,{"$f":"IFERROR(SUMIF(B:B,B31,D:D)/SUMIF(B:B,B31,C:C),\"\")","v":""}]
[null,null,null,null,"",null,null,{"$f":"IFERROR(SUMIF(B:B,B32,D:D)/SUMIF(B:B,B32,C:C),\"\")","v":""}]
[null,null,null,null,"",null,null,{"$f":"IFERROR(SUMIF(B:B,B33,D:D)/SUMIF(B:B,B33,C:C),\"\")","v":""}]
[null,null,null,null,"",null,null,{"$f":"IFERROR(SUMIF(B:B,B34,D:D)/SUMIF(B:B,B34,C:C),\"\")","v":""}]
[null,null,null,null,"",null,null,{"$f":"IFERROR(SUMIF(B:B,B35,D:D)/SUMIF(B:B,B35,C:C),\"\")","v":""}]
[null,null,null,null,"",null,null,{"$f":"IFERROR(SUMIF(B:B,B36,D:D)/SUMIF(B:B,B36,C:C),\"\")","v":""}]
[null,null,null,null,"",null,null,{"$f":"IFERROR(SUMIF(B:B,B37,D:D)/SUMIF(B:B,B37,C:C),\"\")","v":""}]
[null,null,null,null,"",null,null,{"$f":"IFERROR(SUMIF(B:B,B38,D:D)/SUMIF(B:B,B38,C:C),\"\")","v":""}]
[null,null,null,null,"",null,null,{"$f":"IFERROR(SUMIF(B:B,B39,D:D)/SUMIF(B:B,B39,C:C),\"\")","v":""}]
[null,null,null,null,{"$f":"IFERROR(D40/C40,\"\")","v":""},null,null,{"$f":"IFERROR(SUMIF(B:B,B40,D:D)/SUMIF(B:B,B40,C:C),\"\")","v":""}]
{"$rows_left_out":963}
{"sheet":"SaleInfo","index":2,"n_rows":1002,"n_cols":6,"rows_kept":1002,"cut":false,"hidden":false,"merged":[[0,3,0,4]]}
["Sale Info",null,null,"Only enter shares sold, not bought.\n(Enter Volume Sold and Stock)"]
["Date","Stock","Volume Sold","Total Value Sold","Share Sale Price","Notes"]
["2019-06-12","NCBFG (JMD)",12000,2520000,{"$f":"IFERROR(D3/C3,\"\")","v":210}]
[null,null,null,null,{"$f":"IFERROR(D4/C4,\"\")","v":""}]
[null,null,null,null,""]
[null,null,null,null,""]
[null,null,null,null,""]
[null,null,null,null,""]
[null,null,null,null,""]
[null,null,null,null,""]
[null,null,null,null,""]
[null,null,null,null,""]
[null,null,null,null,""]
[null,null,null,null,""]
[null,null,null,null,""]
[null,null,null,null,""]
[null,null,null,null,""]
[null,null,null,null,""]
[null,null,null,null,""]
[null,null,null,null,""]
[null,null,null,null,""]
[null,null,null,null,""]
[null,null,null,null,""]
[null,null,null,null,""]
[null,null,null,null,""]
[null,null,null,null,""]
[null,null,null,null,""]
[null,null,null,null,""]
[null,null,null,null,""]
[null,null,null,null,""]
[null,null,null,null,""]
[null,null,null,null,""]
[null,null,null,null,""]
[null,null,null,null,""]
[null,null,null,null,""]
[null,null,null,null,""]
[null,null,null,null,""]
[null,null,null,null,""]
[null,null,null,null,""]
[null,null,null,null,""]
{"$rows_left_out":963}
{"sheet":"Instructions","index":3,"n_rows":15,"n_cols":1,"rows_kept":15,"cut":false,"hidden":false,"merged":[]}
["Instructions:"]
[]
["1. Download and open the file. Ensure you allow any connections or macros it asks for, these are needed for it to function correctly."]
["(NOTE: Microsoft Excel 2013 or newer is needed to run this file successfully)"]
[]
["2. Go to the \"Purchase Info\" tab, remove the example filler data (Columns A to D). "]
["3. Input your own purchase data, putting each stock purchase in its own line like the filler example showed. (Multiple purchases of the same stock should be entered in multiple lines)\n(NOTE: THE PROPER TICKER SYNTAX MUST BE USED. E.g. \"NCBFG (JMD)\" not \"NCBFG\")"]
["4. Go to the \"SaleInfo\" tab, remove the example filler data (Columns A to D)."]
["5. Input your own sale data, putting each stock sale you've done in its own line and matching the (previously deleted) filler example. (Multiple sales of the same stock should also be entered in multiple lines)\n(NOTE: THE PROPER TICKER SYNTAX MUST BE USED. E.g. \"NCBFG (JMD)\" not \"NCBFG\")"]
["6. Go to the Dashboard Tab (ignore any errors the sheet may be currently showing) and remove the filler dashboard entry (Column A ONLY)."]
["7. Input the stock ticker of ALL the stocks you have purchased into the Dashboard starting at Column A, Row 17. (Note: you will only be able to enter data in Column A on the dashboard. All the other data will automatically fill itself in and update afterwards.(You only need to enter a stock you own once, regardless of how many times you purchased it. The sheet will calculate the details)\n(NOTE: THE PROPER TICKER SYNTAX MUST BE USED. E.g. \"NCBFG (JMD)\" not \"NCBFG\")"]
["8. Hit the red \"Refresh\" button at the top of Column E. The dashboard will connect to the internet, get the latest prices for all JSE listed stocks, and update your portfolio to the current value as of the last closing date that JSE has available."]
["PLEASE NOTE:"]
["1. This dashboard relies on JSE's server's which are at times unreliable. It is not uncommon to refresh and get an error. If that happens, simply ensure you're connected to the internet and hit refresh again."]
["2. Areas in the file which are needed for calculation and should not be edited will not be accessible and will prompt for a password if attempted to be edited. These areas do not need to be edited and you do not need the password for the sheet to work correctly."]

{"sheet":"JSESiteQuery","index":4,"n_rows":204,"n_cols":13,"rows_kept":204,"cut":false,"hidden":true,"merged":[]}
["Logo"]
["Sign in"]
["or Register for a Free Account"]
["Home"]
["News"]
["Events"]
["Market Data"]
["Investor Centre"]
["Products"]
["Services"]
["MYJSE"]
["About"]
["Jamaica Stock Exchange > Market Data > Daily Market Quote"]
["Daily Market Quote"]
["Combined Market for May 15, 2020"]
["Markets:"]
["Archived Reports:"]
["Go Download CSV"]
["INDICES"]
["Index","Value","Volume","Change","Change(%)"]
["JSE Combined Index ",371399.39,29737412,-1923.06,-0.52]
["JSE Index ",375066.49,24395591,-2003.95,-0.53]
["JSE All Jamaican Composite Index ",411473.46,24394591,-2215.5500000000002,-0.54]
["JSE Select Index ",9498.8700000000008,1148235,-59.96,-0.63]
["JSE Cross Listed Index ",83.16,1000,7.0000000000000007E-2,0.08]
["Junior Market Index ",2444.9899999999998,5341821,-7.34,-0.3]
["JSE USD Equities Index ",186.97,1343277,-5.58,-2.9]
["JSE Financial Index",100.42,3790638,-1.04,-1.03]
["JSE Manufacturing & Distribution Index",74.709999999999994,1183101,-0.04,-0.05]
["ORDINARY SHARES"]
["Security ","Last Traded","Close","Price","Closing","Closing","Volume","Today's","Today's","52 Week","52 Week","Prev","Current"]
[null,"Price","Price","Change","Bid","Ask","(non block)","High","Low","High","Low","Yr Div","Yr Div"]
["138SL (JMD)",8.8000000000000007,7.97,0.42,8.8000000000000007,8.99,43495,9.19,7.75,9.48,2.85]
["1834 (JMD)",0.8,0.8,-0.05,0.8,0.9,59522,0.85,0.8,1.26,0.75]
["AFSVR2020 (JMD)",0,99.5,0,0,0,0,0,0,0,0]
["AFS (JMD)",22.1,22.81,0,23.1,26.5,0,0,0,48,17.649999999999999]
["AFSVR2025 (JMD)",0,100,0,0,0,0,0,0,0,0]
["AMG (JMD)",1.76,1.76,0,1.65,1.76,0,0,0,2.5,1.3]
["BIL (JMD)",51.21,51.18,-0.2,48.5,52,1497515,51.7,46.57,100,41]
["BRG (JMD)",14,14,0.3,13.3,14,125,14,14,20.6,9.5]
{"$rows_left_out":164}